BDBM385222 US10287267, Compound 500::US10508099, Compound 500::US10556885, Compound 500::US11174244, Compound 500::US11673881, Compound 500
SMILES CN1CCN(CC(=O)Nc2cc3cc(ccc3cn2)-c2cn(C)nn2)CC1
InChI Key InChIKey=XXLSUDMGRSTLHW-UHFFFAOYSA-N
Data  12 EC50
  Tab Delimited (TSV)   2D SDfile   Computed 3D by Vconf -m prep SDfile
Find this compound or compounds like it in BindingDB:
Activity Spreadsheet -- Enzyme Inhibition Constant Data from BindingDB
Found 12 hits for monomerid = 385222
TargetGlycogen synthase kinase-3 beta(Homo sapiens (Human))
Samumed
US Patent
LigandPNGBDBM385222(US10287267, Compound 500 | US10508099, Compound 50...)
Affinity DataEC50:  23nM. Assay description: Each compound is dissolved in DMSO as a 10 mM stock and used to prepare compound source plates. Serial dilution (1:3, 11-point dose-response curves f...
Ligand InfoPC cidPC sid
In DepthDetails US Patent
TargetProto-oncogene Wnt-1(Homo sapiens (human))
Samumed
US Patent
LigandPNGBDBM385222(US10287267, Compound 500 | US10508099, Compound 50...)
Affinity DataEC50:  3.23E+3nM. Assay description: The screening assay for Wnt activity is described as follows. Reporter cell lines can be generated by stably transducing cancer cell lines (e.g., col...
Ligand InfoPC cidPC sid
In DepthDetails US Patent
TargetDual specificity tyrosine-phosphorylation-regulated kinase 1A(Homo sapiens (Human))
Samumed
US Patent
LigandPNGBDBM385222(US10287267, Compound 500 | US10508099, Compound 50...)
Affinity DataEC50:  10.6nM. Assay description: Each compound was dissolved in DMSO as a 10 mM stock and used to prepare compound source plates. Serial dilution (1:3, 11-point dose-response curves ...
Ligand InfoPC cidPC sid
In DepthDetails US Patent
TargetProto-oncogene Wnt-1(Homo sapiens (human))
Samumed
US Patent
LigandPNGBDBM385222(US10287267, Compound 500 | US10508099, Compound 50...)
Affinity DataEC50:  3.23E+3nM. Assay description: SW480 colon carcinoma cells were transduced with a lentiviral vector expressing luciferase with a human Sp5 promoter consisting of a sequence of eigh...
Ligand InfoPC cidPC sid
In DepthDetails US Patent
TargetDual specificity tyrosine-phosphorylation-regulated kinase 1A(Homo sapiens (Human))
Samumed
US Patent
LigandPNGBDBM385222(US10287267, Compound 500 | US10508099, Compound 50...)
Affinity DataEC50:  10.6nM. Assay description: Each compound was dissolved in DMSO as a 10 mM stock and used to prepare compound source plates. Serial dilution (1:3, 11-point dose-response curves ...
Ligand InfoPC cidPC sid
In DepthDetails US Patent
TargetGlycogen synthase kinase-3 beta(Homo sapiens (Human))
Samumed
US Patent
LigandPNGBDBM385222(US10287267, Compound 500 | US10508099, Compound 50...)
Affinity DataEC50:  23nM. Assay description: The GSK3B kinase assay is run using the Ser/Thr 09 peptide Z-lyte assay kit according to manufacturer's instructions (Life Technologies-a Divisio...
Ligand InfoPC cidPC sid
In DepthDetails US Patent
TargetDual specificity tyrosine-phosphorylation-regulated kinase 1A(Homo sapiens (Human))
Samumed
US Patent
LigandPNGBDBM385222(US10287267, Compound 500 | US10508099, Compound 50...)
Affinity DataEC50:  10.6nM. Assay description: The DYRK1A kinase assay was run using the Ser/Thr 18 peptide Z-lyte assay kit according to manufacturer's instructions. This is a non-radioactive...
Ligand InfoPC cidPC sid
In DepthDetails US Patent
TargetGlycogen synthase kinase-3 beta(Homo sapiens (Human))
Samumed
US Patent
LigandPNGBDBM385222(US10287267, Compound 500 | US10508099, Compound 50...)
Affinity DataEC50:  23nM. Assay description: GSK3B: This is a non-radioactive assay using fluorescence resonance energy transfer (FRET) between coumarin and fluorescein to detect kinase activity...
Ligand InfoPC cidPC sid
In DepthDetails US Patent
TargetDual specificity tyrosine-phosphorylation-regulated kinase 1A(Homo sapiens (Human))
Samumed
US Patent
LigandPNGBDBM385222(US10287267, Compound 500 | US10508099, Compound 50...)
Affinity DataEC50:  10.6nM. Assay description: The DYRK1A kinase assay was run using the Ser/Thr 18 peptide Z-lyte assay kit according to manufacturer's instructions (Life Technologies—a Divis...
Ligand InfoPC cidPC sid
In DepthDetails US Patent
TargetGlycogen synthase kinase-3 beta(Homo sapiens (Human))
Samumed
US Patent
LigandPNGBDBM385222(US10287267, Compound 500 | US10508099, Compound 50...)
Affinity DataEC50:  23nM. Assay description: The GSK3β kinase assay is run using the Ser/Thr 09 peptide Z-lyte assay kit according to manufacturer's instructions (Life Technologies—a Di...
Ligand InfoPC cidPC sid
In DepthDetails US Patent
TargetDual specificity tyrosine-phosphorylation-regulated kinase 1A(Homo sapiens (Human))
Samumed
US Patent
LigandPNGBDBM385222(US10287267, Compound 500 | US10508099, Compound 50...)
Affinity DataEC50:  10.6nM. Assay description: Each compound was dissolved in DMSO as a 10 mM stock and used to prepare compound source plates. Serial dilution (1:3, 11-point dose-response curves ...
Ligand InfoPC cidPC sid
In DepthDetails US Patent
TargetGlycogen synthase kinase-3 beta(Homo sapiens (Human))
Samumed
US Patent
LigandPNGBDBM385222(US10287267, Compound 500 | US10508099, Compound 50...)
Affinity DataEC50:  23nM. Assay description: Each compound is dissolved in DMSO as a 10 mM stock and used to prepare compound source plates. Serial dilution (1:3, 11-point dose-response curves f...
Ligand InfoPC cidPC sid
In DepthDetails US Patent