BDBM385517 4-((R or S)-1-(2-chloro-6-cyclopropylbenzoyl)-6-(3-methoxyazetidine-1-carbonyl)-6-methyl-4,5,6,7-tetrahydro-1H-indazol-3-yl)cyclohex-3-ene-1-carboxylic acid::US10287272, Example 9A
SMILES COC1CN(C1)C(=O)C1(C)CCc2c(C1)n(nc2C1=CCC(CC1)C(O)=O)C(=O)c1c(Cl)cccc1C1CC1
InChI Key InChIKey=AMWNOECANKTNAH-UHFFFAOYSA-N
Data  1 IC50
  Tab Delimited (TSV)   2D SDfile   Computed 3D by Vconf -m prep SDfile
Find this compound or compounds like it in BindingDB:
Activity Spreadsheet -- Enzyme Inhibition Constant Data from BindingDB
Found 1 hit for monomerid = 385517
TargetNuclear receptor ROR-gamma(Homo sapiens (Human))
Merck Sharp & Dohme
US Patent
LigandPNGBDBM385517(4-((R or S)-1-(2-chloro-6-cyclopropylbenzoyl)-6-(3...)
Affinity DataIC50:  446nM. Assay description: To identify novel antagonists of RORgammaT, an assay was developed which employs the interaction of RORgammaT with its co-activator peptide SRC1_2. T...
Ligand InfoPC cidPC sid
In DepthDetails US Patent