BDBM38554 3-morpholin-4-yl-N'-oxidanyl-propanimidamide::MLS000027652::N'-hydroxy-3-(4-morpholinyl)propanimidamide::N'-hydroxy-3-morpholin-4-ylpropanimidamide::N'-hydroxy-3-morpholino-propionamidine::SMR000035310::cid_658263
SMILES ONC(=N)CCN1CCOCC1
InChI Key InChIKey=VGMYEKAPTYTGAL-UHFFFAOYSA-N
Data  3 IC50
  Tab Delimited (TSV)   2D SDfile   Computed 3D by Vconf -m prep SDfile
Find this compound or compounds like it in BindingDB:
Activity Spreadsheet -- Enzyme Inhibition Constant Data from BindingDB
Found 3 hits for monomerid = 38554
TargetMevalonate kinase(Streptococcus pneumoniae D39)
Srmlsc
Curated by PubChem BioAssay
LigandPNGBDBM38554(3-morpholin-4-yl-N'-oxidanyl-propanimidamide | MLS...)
Affinity DataIC50: >1.00E+7nM. Assay description: Southern Research Molecular Libraries Screening Center (SRMLSC) Southern Research Institute (Birmingham, Alabama) NIH Molecular Libraries Screening C...
Ligand InfoPC cidPC sid
In DepthDetails PCBioAssay
TargetMevalonate kinase(Streptococcus pneumoniae D39)
Srmlsc
Curated by PubChem BioAssay
LigandPNGBDBM38554(3-morpholin-4-yl-N'-oxidanyl-propanimidamide | MLS...)
Affinity DataIC50: >1.00E+7nM. Assay description: Southern Research Molecular Libraries Screening Center (SRMLSC) Southern Research Institute (Birmingham, Alabama) NIH Molecular Libraries Screening C...
Ligand InfoPC cidPC sid
In DepthDetails PCBioAssay
TargetMevalonate kinase(Streptococcus pneumoniae D39)
Srmlsc
Curated by PubChem BioAssay
LigandPNGBDBM38554(3-morpholin-4-yl-N'-oxidanyl-propanimidamide | MLS...)
Affinity DataIC50: >1.00E+7nM. Assay description: Southern Research Molecular Libraries Screening Center (SRMLSC) Southern Research Institute (Birmingham, Alabama) NIH Molecular Libraries Screening C...
Ligand InfoPC cidPC sid
In DepthDetails PCBioAssay