BDBM385549 US10287278, Example 11::US10647706, Example 11
SMILES CC[C@@H](Nc1c(Nc2ccc(Cl)c(c2O)S(C)(=O)=NCCOC)c(=O)c1=O)c1ccc(C)o1
InChI Key InChIKey=AQPWWJLGEBLXRS-PXYRPBPISA-N
Data  4 IC50
  Tab Delimited (TSV)   2D SDfile   Computed 3D by Vconf -m prep SDfile
Find this compound or compounds like it in BindingDB:
Activity Spreadsheet -- Enzyme Inhibition Constant Data from BindingDB
Found 4 hits for monomerid = 385549
TargetC-X-C chemokine receptor type 2(Homo sapiens (Human))
Galderma Research & Development
US Patent
LigandPNGBDBM385549(US10287278, Example 11 | US10647706, Example 11)
Affinity DataIC50: >20nM. Assay description: The in vitro affinity of the compounds of the present invention for the CXCR1 and CXCR2 receptors is determined on a functional test of β-arrest...
Ligand InfoPC cidPC sid
In DepthDetails US Patent
TargetC-X-C chemokine receptor type 2(Homo sapiens (Human))
Galderma Research & Development
US Patent
LigandPNGBDBM385549(US10287278, Example 11 | US10647706, Example 11)
Affinity DataIC50: >200nM. Assay description: To evaluate the direct interaction of the CXCR2 or CXCR1 receptor with β-arrestin 2, a test of β-arrestin 2 recruitment for CXCR2 or CXCR1 ...
Ligand InfoPC cidPC sid
In DepthDetails US Patent
TargetC-X-C chemokine receptor type 1(Homo sapiens (Human))
Galderma Research & Development
US Patent
LigandPNGBDBM385549(US10287278, Example 11 | US10647706, Example 11)
Affinity DataIC50: >20nM. Assay description: To evaluate the direct interaction of the CXCR2 or CXCR1 receptor with β-arrestin 2, a test of β-arrestin 2 recruitment for CXCR2 or CXCR1 ...
Ligand InfoPC cidPC sid
In DepthDetails US Patent
TargetC-X-C chemokine receptor type 1(Homo sapiens (Human))
Galderma Research & Development
US Patent
LigandPNGBDBM385549(US10287278, Example 11 | US10647706, Example 11)
Affinity DataIC50: >200nM. Assay description: The in vitro affinity of the compounds of the present invention for the CXCR1 and CXCR2 receptors is determined on a functional test of β-arrest...
Ligand InfoPC cidPC sid
In DepthDetails US Patent