BDBM385564 US10287279, Compound 6
SMILES CNC1OC(=NC1C#N)c1cccc2nccnc12
InChI Key InChIKey=SMTMVOOXNXKZNI-UHFFFAOYSA-N
Data  1 IC50
  Tab Delimited (TSV)   2D SDfile   Computed 3D by Vconf -m prep SDfile
Find this compound or compounds like it in BindingDB:
Activity Spreadsheet -- Enzyme Inhibition Constant Data from BindingDB
Found 1 hit for monomerid = 385564
TargetPolyunsaturated fatty acid lipoxygenase ALOX15(Homo sapiens (Human))
The Children'S Hospital
US Patent
LigandPNGBDBM385564(US10287279, Compound 6)
Affinity DataIC50: >4.00E+4nM. Assay description: The inhibitor compounds were screened initially using one concentration point on a Perkin-Elmer Lambda 40 UV-Vis spectrometer. The percent inhibition...
Ligand InfoPC cidPC sid
In DepthDetails US Patent