BDBM385586 US10287279, Compound 28
SMILES N#CC1N=C(OC1NCc1ccccc1)c1cccc2ccccc12
InChI Key InChIKey=WXYQRDGKCRZAQH-UHFFFAOYSA-N
Data  1 IC50
  Tab Delimited (TSV)   2D SDfile   Computed 3D by Vconf -m prep SDfile
Find this compound or compounds like it in BindingDB:
Activity Spreadsheet -- Enzyme Inhibition Constant Data from BindingDB
Found 1 hit for monomerid = 385586
TargetPolyunsaturated fatty acid lipoxygenase ALOX15(Homo sapiens (Human))
The Children'S Hospital
US Patent
LigandPNGBDBM385586(US10287279, Compound 28)
Affinity DataIC50: >3.00E+4nM. Assay description: The inhibitor compounds were screened initially using one concentration point on a Perkin-Elmer Lambda 40 UV-Vis spectrometer. The percent inhibition...
Ligand InfoPC cidPC sid
In DepthDetails US Patent