BDBM385601 US10287292, Compound 1.005::US11059825, Compound 1.005
SMILES CS(=O)(=O)c1ccc(cc1)-n1cnc(n1)C(=O)N[C@H]1CCN(C1)c1nccn2ccnc12
InChI Key InChIKey=WLYCRXCTDHCSEX-AWEZNQCLSA-N
Data  2 IC50
  Tab Delimited (TSV)   2D SDfile   Computed 3D by Vconf -m prep SDfile
Find this compound or compounds like it in BindingDB:
Activity Spreadsheet -- Enzyme Inhibition Constant Data from BindingDB
Found 2 hits for monomerid = 385601
TargetAtypical chemokine receptor 3(Homo sapiens (Human))
Chemocentryx
US Patent
LigandPNGBDBM385601(US10287292, Compound 1.005 | US11059825, Compound ...)
Affinity DataIC50:  8.75E+3nM. Assay description: In order to more properly assess the binding efficacy of the compounds, radioligand binding assays were carried out in the presence of 100% human ser...
Ligand InfoPC cidPC sid
In DepthDetails US Patent
TargetAtypical chemokine receptor 3(Homo sapiens (Human))
Chemocentryx
US Patent
LigandPNGBDBM385601(US10287292, Compound 1.005 | US11059825, Compound ...)
Affinity DataIC50: >2.50E+3nM. Assay description: In order to more properly assess the binding efficacy of the compounds, radioligand binding assays were carried out in the presence of 100% human ser...
Ligand InfoPC cidPC sid
In DepthDetails US Patent