BDBM385694 4-{7-(2- methoxyethyl) amino}- [1,2,4]triazolo[1,5- a]pyridin-5- yl}benzonitrile::US10287286, Example 102
SMILES COCCNc1cc(-c2ccc(cc2)C#N)n2ncnc2c1
InChI Key InChIKey=WGGZDJUYALKJIH-UHFFFAOYSA-N
Data  1 IC50
  Tab Delimited (TSV)   2D SDfile   Computed 3D by Vconf -m prep SDfile
Find this compound or compounds like it in BindingDB:
Activity Spreadsheet -- Enzyme Inhibition Constant Data from BindingDB
Found 1 hit for monomerid = 385694
TargetProlyl hydroxylase EGLN2(Homo sapiens (Human))
Takeda Pharmaceutical
US Patent
LigandPNGBDBM385694(4-{7-(2- methoxyethyl) amino}- [1,2,4]triazolo[1,5...)
Affinity DataIC50:  34nM. Assay description: The IC50 values for the PHD1 enzyme (residues 1-407) were determined by mixing increasing amounts of a compound of the invention with a fixed amount ...
Ligand InfoPC cidPC sid
In DepthDetails US Patent