BDBM385743 US10287292, Compound 1.031::US11059825, Compound 1.031
SMILES Cc1cn2ccnc2c(n1)N1CC[C@@H](C1)NC(=O)c1cn(cn1)-c1ccccc1
InChI Key InChIKey=PHUPCLPDZLCYBU-INIZCTEOSA-N
Data  2 IC50
  Tab Delimited (TSV)   2D SDfile   Computed 3D by Vconf -m prep SDfile
Find this compound or compounds like it in BindingDB:
Activity Spreadsheet -- Enzyme Inhibition Constant Data from BindingDB
Found 2 hits for monomerid = 385743
TargetAtypical chemokine receptor 3(Homo sapiens (Human))
Chemocentryx
US Patent
LigandPNGBDBM385743(US10287292, Compound 1.031 | US11059825, Compound ...)
Affinity DataIC50: <500nM. Assay description: In order to more properly assess the binding efficacy of the compounds, radioligand binding assays were carried out in the presence of 100% human ser...
Ligand InfoPC cidPC sid
In DepthDetails US Patent
TargetAtypical chemokine receptor 3(Homo sapiens (Human))
Chemocentryx
US Patent
LigandPNGBDBM385743(US10287292, Compound 1.031 | US11059825, Compound ...)
Affinity DataIC50: <500nM. Assay description: In order to more properly assess the binding efficacy of the compounds, radioligand binding assays were carried out in the presence of 100% human ser...
Ligand InfoPC cidPC sid
In DepthDetails US Patent