BDBM385820 US10287286, Example 219
SMILES Oc1cc(-c2ccc(C#N)c(F)c2)n2ncnc2c1
InChI Key InChIKey=GNOYFDYKXJPUML-UHFFFAOYSA-N
Data  1 IC50
  Tab Delimited (TSV)   2D SDfile   Computed 3D by Vconf -m prep SDfile
Find this compound or compounds like it in BindingDB:
Activity Spreadsheet -- Enzyme Inhibition Constant Data from BindingDB
Found 1 hit for monomerid = 385820
TargetProlyl hydroxylase EGLN2(Homo sapiens (Human))
Takeda Pharmaceutical
US Patent
LigandPNGBDBM385820(US10287286, Example 219)
Affinity DataIC50:  30nM. Assay description: The IC50 values for the PHD1 enzyme (residues 1-407) were determined by mixing increasing amounts of a compound of the invention with a fixed amount ...
Ligand InfoPC cidPC sid
In DepthDetails US Patent