BDBM385822 Trans-2-((2′-fluoro-5′-isopropoxy-[1,1′-biphenyl]-4-yl)methoxy)cyclopropanecarboxylic acid::US9938222, Example 37
SMILES CC(C)Oc1ccc(F)c(c1)-c1ccc(COC2CC2C(O)=O)cc1
InChI Key InChIKey=PBONQWLZFCYTNH-UHFFFAOYSA-N
Data  1 EC50
  Tab Delimited (TSV)   2D SDfile   Computed 3D by Vconf -m prep SDfile
Find this compound or compounds like it in BindingDB:
Activity Spreadsheet -- Enzyme Inhibition Constant Data from BindingDB
Found 1 hit for monomerid = 385822
TargetFree fatty acid receptor 4(Homo sapiens (Human))
Bristol-Myers Squibb
US Patent
LigandPNGBDBM385822(Trans-2-((2′-fluoro-5′-isopropoxy-[1,1...)
Affinity DataEC50:  2.65E+3nM. Assay description: For the pERK assay, 3×106 cells/mL cryopreserved human and mouse cells were thawed rapidly in a 37° C. water bath and added to a T-225 flask containi...
Ligand InfoPC cidPC sid
In DepthDetails US Patent