BDBM385872 US10287292, Compound 1.050::US11059825, Compound 1.050
SMILES OCC1(CCN(C1)c1nccn2ccnc12)NC(=O)c1ncn(n1)-c1ccccc1
InChI Key InChIKey=MIUBGEHYBQUUNS-UHFFFAOYSA-N
Data  2 IC50
  Tab Delimited (TSV)   2D SDfile   Computed 3D by Vconf -m prep SDfile
Find this compound or compounds like it in BindingDB:
Activity Spreadsheet -- Enzyme Inhibition Constant Data from BindingDB
Found 2 hits for monomerid = 385872
TargetAtypical chemokine receptor 3(Homo sapiens (Human))
Chemocentryx
US Patent
LigandPNGBDBM385872(US10287292, Compound 1.050 | US11059825, Compound ...)
Affinity DataIC50: <500nM. Assay description: In order to more properly assess the binding efficacy of the compounds, radioligand binding assays were carried out in the presence of 100% human ser...
Ligand InfoPC cidPC sid
In DepthDetails US Patent
TargetAtypical chemokine receptor 3(Homo sapiens (Human))
Chemocentryx
US Patent
LigandPNGBDBM385872(US10287292, Compound 1.050 | US11059825, Compound ...)
Affinity DataIC50: <500nM. Assay description: In order to more properly assess the binding efficacy of the compounds, radioligand binding assays were carried out in the presence of 100% human ser...
Ligand InfoPC cidPC sid
In DepthDetails US Patent