BDBM38609 2-phenyl-5-propan-2-yl-1H-1,2,4-triazole-3-thione::5-isopropyl-2-phenyl-1,2-dihydro-3H-1,2,4-triazole-3-thione::5-isopropyl-2-phenyl-1H-1,2,4-triazole-3-thione::MLS000090358::SMR000024968::cid_672502
SMILES CC(C)c1nn(-c2ccccc2)c(=S)[nH]1
InChI Key InChIKey=LJGXJWLGMAKTTJ-UHFFFAOYSA-N
Data  3 IC50
  Tab Delimited (TSV)   2D SDfile   Computed 3D by Vconf -m prep SDfile
Find this compound or compounds like it in BindingDB:
Activity Spreadsheet -- Enzyme Inhibition Constant Data from BindingDB
Found 3 hits for monomerid = 38609
TargetMevalonate kinase(Streptococcus pneumoniae D39)
Srmlsc
Curated by PubChem BioAssay
LigandPNGBDBM38609(2-phenyl-5-propan-2-yl-1H-1,2,4-triazole-3-thione ...)
Affinity DataIC50:  4.23E+4nM. Assay description: Southern Research Molecular Libraries Screening Center (SRMLSC) Southern Research Institute (Birmingham, Alabama) NIH Molecular Libraries Screening C...
In DepthDetails PCBioAssay
TargetMevalonate kinase(Streptococcus pneumoniae D39)
Srmlsc
Curated by PubChem BioAssay
LigandPNGBDBM38609(2-phenyl-5-propan-2-yl-1H-1,2,4-triazole-3-thione ...)
Affinity DataIC50:  8.36E+4nM. Assay description: Southern Research Molecular Libraries Screening Center (SRMLSC) Southern Research Institute (Birmingham, Alabama) NIH Molecular Libraries Screening C...
In DepthDetails PCBioAssay
TargetMevalonate kinase(Streptococcus pneumoniae D39)
Srmlsc
Curated by PubChem BioAssay
LigandPNGBDBM38609(2-phenyl-5-propan-2-yl-1H-1,2,4-triazole-3-thione ...)
Affinity DataIC50: >1.00E+7nM. Assay description: Southern Research Molecular Libraries Screening Center (SRMLSC) Southern Research Institute (Birmingham, Alabama) NIH Molecular Libraries Screening C...
In DepthDetails PCBioAssay