BDBM386147 US10287305, Example 100::US10508083, Example 100::US11292766, Example 100::cis-2-(((cis-4- isopropylcyclohexyl)oxy)methyl)-3- ((methylsulfonyl)amino)-N- propylpiperidine-1-carboxamide
SMILES CCCNC(=O)N1CCC[C@H](NS(C)(=O)=O)[C@@H]1CO[C@H]1CC[C@H](CC1)C(C)C
InChI Key InChIKey=FKLCVQLKHNAGTR-RDGPPVDQSA-N
Data  3 EC50
  Tab Delimited (TSV)   2D SDfile   Computed 3D by Vconf -m prep SDfile
Find this compound or compounds like it in BindingDB:
Activity Spreadsheet -- Enzyme Inhibition Constant Data from BindingDB
Found 3 hits for monomerid = 386147
TargetOrexin receptor type 2(Homo sapiens (Human))
Takeda Pharmaceutical
US Patent
LigandPNGBDBM386147(US10287305, Example 100 | US10508083, Example 100 ...)
Affinity DataEC50:  2.20nM. Assay description: Chinese hamster ovary (CHO) dhfr-cells forcibly expressing human orexin type 2 receptor (hOX2R) were seeded in each well of Black clear bottom plate ...
Ligand InfoPC cidPC sid
In DepthDetails US Patent
TargetOrexin receptor type 2(Homo sapiens (Human))
Takeda Pharmaceutical
US Patent
LigandPNGBDBM386147(US10287305, Example 100 | US10508083, Example 100 ...)
Affinity DataEC50:  2.20nM. Assay description: Chinese hamster ovary (CHO) dhfr-cells forcibly expressing human orexin type 2 receptor (hOX2R) were seeded in each well of Black clear bottom plate ...
Ligand InfoPC cidPC sid
In DepthDetails US Patent
TargetOrexin receptor type 2(Homo sapiens (Human))
Takeda Pharmaceutical
US Patent
LigandPNGBDBM386147(US10287305, Example 100 | US10508083, Example 100 ...)
Affinity DataEC50:  2.20nM. Assay description: Chinese hamster ovary (CHO) dhfr-cells forcibly expressing human orexin type 2 receptor (hOX2R) were seeded in each well of Black clear bottom plate ...
Ligand InfoPC cidPC sid
In DepthDetails US Patent