BDBM386152 N-(cis-1-acetyl-2-(((cis-4- (trifluoromethyl)cyclohexyl)oxy)- methyl)piperidin-3- yl)methanesulfonamide::US10287305, Example 106::US10508083, Example 106::US11292766, Example 106
SMILES CC(=O)N1CCC[C@H](NS(C)(=O)=O)[C@@H]1CO[C@H]1CC[C@H](CC1)C(F)(F)F
InChI Key InChIKey=NADMMIBRVIEWOT-XGUBFFRZSA-N
Data  3 EC50
  Tab Delimited (TSV)   2D SDfile   Computed 3D by Vconf -m prep SDfile
Find this compound or compounds like it in BindingDB:
Activity Spreadsheet -- Enzyme Inhibition Constant Data from BindingDB
Found 3 hits for monomerid = 386152
TargetOrexin receptor type 2(Homo sapiens (Human))
Takeda Pharmaceutical
US Patent
LigandPNGBDBM386152(N-(cis-1-acetyl-2-(((cis-4- (trifluoromethyl)cyclo...)
Affinity DataEC50:  4.80E+3nM. Assay description: Chinese hamster ovary (CHO) dhfr-cells forcibly expressing human orexin type 2 receptor (hOX2R) were seeded in each well of Black clear bottom plate ...
Ligand InfoPC cidPC sid
In DepthDetails US Patent
TargetOrexin receptor type 2(Homo sapiens (Human))
Takeda Pharmaceutical
US Patent
LigandPNGBDBM386152(N-(cis-1-acetyl-2-(((cis-4- (trifluoromethyl)cyclo...)
Affinity DataEC50:  4.80E+3nM. Assay description: Chinese hamster ovary (CHO) dhfr-cells forcibly expressing human orexin type 2 receptor (hOX2R) were seeded in each well of Black clear bottom plate ...
Ligand InfoPC cidPC sid
In DepthDetails US Patent
TargetOrexin receptor type 2(Homo sapiens (Human))
Takeda Pharmaceutical
US Patent
LigandPNGBDBM386152(N-(cis-1-acetyl-2-(((cis-4- (trifluoromethyl)cyclo...)
Affinity DataEC50:  4.80E+3nM. Assay description: Chinese hamster ovary (CHO) dhfr-cells forcibly expressing human orexin type 2 receptor (hOX2R) were seeded in each well of Black clear bottom plate ...
Ligand InfoPC cidPC sid
In DepthDetails US Patent