BDBM386398 (2S,4R)-1-(2-(3- acetyl-6-hydroxy-5- (2-methylpyrimidin-5- yl)-1H-indol-1- yl)acetyl)-N-(6- bromopyridin-2- yl)-4- fluoropyrrolidine-2- carboxamide::US10287301, Compound 328::US10822352, Comp No. 328
SMILES CC(=O)c1cn(CC(=O)N2C[C@H](F)C[C@H]2C(=O)Nc2cccc(Br)n2)c2cc(O)c(cc12)-c1cnc(C)nc1
InChI Key InChIKey=PJPPLXDHQWEKJR-VGSWGCGISA-N
Data  2 IC50
  Tab Delimited (TSV)   2D SDfile   Computed 3D by Vconf -m prep SDfile
Find this compound or compounds like it in BindingDB:
Activity Spreadsheet -- Enzyme Inhibition Constant Data from BindingDB
Found 2 hits for monomerid = 386398
TargetComplement factor D(Homo sapiens (Human))
Achillion Pharmaceuticals
US Patent
LigandPNGBDBM386398((2S,4R)-1-(2-(3- acetyl-6-hydroxy-5- (2-methylpyri...)
Affinity DataIC50: <1.00E+3nM. Assay description: Human Factor D (purified from human serum, Complement Technology, Inc.) at 80 nM final concentration was incubated with test compound at various conc...
Ligand InfoPC cidPC sid
In DepthDetails US Patent
TargetComplement factor D(Homo sapiens (Human))
Achillion Pharmaceuticals
US Patent
LigandPNGBDBM386398((2S,4R)-1-(2-(3- acetyl-6-hydroxy-5- (2-methylpyri...)
Affinity DataIC50: <1.00E+3nM. Assay description: Human Factor D (purified from human serum, Complement Technology, Inc.) at 80 nM final concentration was incubated with test compound at various conc...
Ligand InfoPC cidPC sid
In DepthDetails US Patent