BDBM386632 (2S,4R)-1-(2-(3- acetyl-5-(2- methylpyrimidin- 5-yl)-1H-indazol- 1-yl)acetyl)-4- fluoro-N-(6- methoxypyridin- 2-yl)pyrrolidine- 2-carboxamide::US10287301, Compound 580::US10822352, Comp No. 580
SMILES COc1cccc(NC(=O)[C@@H]2C[C@@H](F)CN2C(=O)Cn2nc(C(C)=O)c3cc(ccc23)-c2cnc(C)nc2)n1
InChI Key InChIKey=CCYYVSRRIDWNAW-KNQAVFIVSA-N
Data  2 IC50
  Tab Delimited (TSV)   2D SDfile   Computed 3D by Vconf -m prep SDfile
Find this compound or compounds like it in BindingDB:
Activity Spreadsheet -- Enzyme Inhibition Constant Data from BindingDB
Found 2 hits for monomerid = 386632
TargetComplement factor D(Homo sapiens (Human))
Achillion Pharmaceuticals
US Patent
LigandPNGBDBM386632((2S,4R)-1-(2-(3- acetyl-5-(2- methylpyrimidin- 5-y...)
Affinity DataIC50: <1.00E+3nM. Assay description: Human Factor D (purified from human serum, Complement Technology, Inc.) at 80 nM final concentration was incubated with test compound at various conc...
Ligand InfoPC cidPC sid
In DepthDetails US Patent
TargetComplement factor D(Homo sapiens (Human))
Achillion Pharmaceuticals
US Patent
LigandPNGBDBM386632((2S,4R)-1-(2-(3- acetyl-5-(2- methylpyrimidin- 5-y...)
Affinity DataIC50: <1.00E+3nM. Assay description: Human Factor D (purified from human serum, Complement Technology, Inc.) at 80 nM final concentration was incubated with test compound at various conc...
Ligand InfoPC cidPC sid
In DepthDetails US Patent