BDBM386898 N-(cis-2-(((cis-4- phenylcyclohexyl)oxy)methyl)- piperidin-3- yl)cyclopropanesulfonamide::US10287305, Example 353::US10508083, Example 353::US11292766, Example 353
SMILES O=S(=O)(N[C@H]1CCCN[C@H]1CO[C@H]1CC[C@H](CC1)c1ccccc1)C1CC1
InChI Key InChIKey=QDVASRUBWHYCBT-YHELAOLJSA-N
Data  3 EC50
  Tab Delimited (TSV)   2D SDfile   Computed 3D by Vconf -m prep SDfile
Find this compound or compounds like it in BindingDB:
Activity Spreadsheet -- Enzyme Inhibition Constant Data from BindingDB
Found 3 hits for monomerid = 386898
TargetOrexin receptor type 2(Homo sapiens (Human))
Takeda Pharmaceutical
US Patent
LigandPNGBDBM386898(N-(cis-2-(((cis-4- phenylcyclohexyl)oxy)methyl)- p...)
Affinity DataEC50:  1.30E+3nM. Assay description: Chinese hamster ovary (CHO) dhfr-cells forcibly expressing human orexin type 2 receptor (hOX2R) were seeded in each well of Black clear bottom plate ...
Ligand InfoPC cidPC sid
In DepthDetails US Patent
TargetOrexin receptor type 2(Homo sapiens (Human))
Takeda Pharmaceutical
US Patent
LigandPNGBDBM386898(N-(cis-2-(((cis-4- phenylcyclohexyl)oxy)methyl)- p...)
Affinity DataEC50:  1.30E+3nM. Assay description: Chinese hamster ovary (CHO) dhfr-cells forcibly expressing human orexin type 2 receptor (hOX2R) were seeded in each well of Black clear bottom plate ...
Ligand InfoPC cidPC sid
In DepthDetails US Patent
TargetOrexin receptor type 2(Homo sapiens (Human))
Takeda Pharmaceutical
US Patent
LigandPNGBDBM386898(N-(cis-2-(((cis-4- phenylcyclohexyl)oxy)methyl)- p...)
Affinity DataEC50:  1.30E+3nM. Assay description: Chinese hamster ovary (CHO) dhfr-cells forcibly expressing human orexin type 2 receptor (hOX2R) were seeded in each well of Black clear bottom plate ...
Ligand InfoPC cidPC sid
In DepthDetails US Patent