BDBM386915 US9938222, Example 44
SMILES OC(=O)C1CC1COc1ccc(cc1)-c1cc(Oc2ccc(F)cc2)ccc1F
InChI Key InChIKey=NRUJDAPKWOTTGI-UHFFFAOYSA-N
Data  1 EC50
  Tab Delimited (TSV)   2D SDfile   Computed 3D by Vconf -m prep SDfile
Find this compound or compounds like it in BindingDB:
Activity Spreadsheet -- Enzyme Inhibition Constant Data from BindingDB
Found 1 hit for monomerid = 386915
TargetFree fatty acid receptor 4(Homo sapiens (Human))
Bristol-Myers Squibb
US Patent
LigandPNGBDBM386915(US9938222, Example 44)
Affinity DataEC50:  270nM. Assay description: For the pERK assay, 3×106 cells/mL cryopreserved human and mouse cells were thawed rapidly in a 37° C. water bath and added to a T-225 flask containi...
Ligand InfoPC cidPC sid
In DepthDetails US Patent