BDBM386938 US9938222, Example 67
SMILES CC(C)Oc1cc(F)c(F)c(c1)-c1ccc(OC[C@H]2C[C@@H]2C(O)=O)c(F)c1
InChI Key InChIKey=GQIMVNAQHTXADO-DOMZBBRYSA-N
Data  1 EC50
  Tab Delimited (TSV)   2D SDfile   Computed 3D by Vconf -m prep SDfile
Find this compound or compounds like it in BindingDB:
Activity Spreadsheet -- Enzyme Inhibition Constant Data from BindingDB
Found 1 hit for monomerid = 386938
TargetFree fatty acid receptor 4(Homo sapiens (Human))
Bristol-Myers Squibb
US Patent
LigandPNGBDBM386938(US9938222, Example 67)
Affinity DataEC50:  230nM. Assay description: For the pERK assay, 3×106 cells/mL cryopreserved human and mouse cells were thawed rapidly in a 37° C. water bath and added to a T-225 flask containi...
Ligand InfoPC cidPC sid
In DepthDetails US Patent