BDBM386958 Trans-2-(((2′-fluoro-3-formyl-5′-isopropoxy-[1,1′-biphenyl]-4-yl)oxy)methyl) cyclopropanecarboxylic acid (racemate)::US9938222, Example 87
SMILES CC(C)Oc1ccc(F)c(c1)-c1ccc(OCC2CC2C(O)=O)c(C=O)c1
InChI Key InChIKey=XTFWLBJYNWSKFB-UHFFFAOYSA-N
Data  1 EC50
  Tab Delimited (TSV)   2D SDfile   Computed 3D by Vconf -m prep SDfile
Find this compound or compounds like it in BindingDB:
Activity Spreadsheet -- Enzyme Inhibition Constant Data from BindingDB
Found 1 hit for monomerid = 386958
TargetFree fatty acid receptor 4(Homo sapiens (Human))
Bristol-Myers Squibb
US Patent
LigandPNGBDBM386958(Trans-2-(((2′-fluoro-3-formyl-5′-isopr...)
Affinity DataEC50:  1.76E+3nM. Assay description: For the pERK assay, 3×106 cells/mL cryopreserved human and mouse cells were thawed rapidly in a 37° C. water bath and added to a T-225 flask containi...
Ligand InfoPC cidPC sid
In DepthDetails US Patent