BDBM386970 Trans-2-(((2′-fluoro-5′-(3-fluorophenoxy)-3-methoxy-[1,1′-biphenyl]-4-yl)oxy)methyl) cyclopropanecarboxylic acid::US9938222, Example 99
SMILES COc1cc(ccc1OCC1CC1C(O)=O)-c1cc(Oc2cccc(F)c2)ccc1F
InChI Key InChIKey=ZOQBNOWZRUDJTQ-UHFFFAOYSA-N
Data  1 EC50
  Tab Delimited (TSV)   2D SDfile   Computed 3D by Vconf -m prep SDfile
Find this compound or compounds like it in BindingDB:
Activity Spreadsheet -- Enzyme Inhibition Constant Data from BindingDB
Found 1 hit for monomerid = 386970
TargetFree fatty acid receptor 4(Homo sapiens (Human))
Bristol-Myers Squibb
US Patent
LigandPNGBDBM386970(Trans-2-(((2′-fluoro-5′-(3-fluoropheno...)
Affinity DataEC50:  1.14E+3nM. Assay description: For the pERK assay, 3×106 cells/mL cryopreserved human and mouse cells were thawed rapidly in a 37° C. water bath and added to a T-225 flask containi...
Ligand InfoPC cidPC sid
In DepthDetails US Patent