BDBM386977 US9938222, Example 106
SMILES OC(=O)[C@@H]1C[C@H]1COc1ccc(cc1F)-c1cc(Oc2cccc(F)c2)cc(F)c1F
InChI Key InChIKey=NSQWDCZHZGYOTR-SCLBCKFNSA-N
Data  1 EC50
  Tab Delimited (TSV)   2D SDfile   Computed 3D by Vconf -m prep SDfile
Find this compound or compounds like it in BindingDB:
Activity Spreadsheet -- Enzyme Inhibition Constant Data from BindingDB
Found 1 hit for monomerid = 386977
TargetFree fatty acid receptor 4(Homo sapiens (Human))
Bristol-Myers Squibb
US Patent
LigandPNGBDBM386977(US9938222, Example 106)
Affinity DataEC50:  270nM. Assay description: For the pERK assay, 3×106 cells/mL cryopreserved human and mouse cells were thawed rapidly in a 37° C. water bath and added to a T-225 flask containi...
Ligand InfoPC cidPC sid
In DepthDetails US Patent