BDBM386986 US9938222, Example 115
SMILES Cc1ccc(Oc2ccc(F)c(c2)-c2ccc(OCC3C[C@H]3C(O)=O)cc2)cn1
InChI Key InChIKey=RJMDPAGMPLRVHK-CAWMZFRYSA-N
Data  1 EC50
  Tab Delimited (TSV)   2D SDfile   Computed 3D by Vconf -m prep SDfile
Find this compound or compounds like it in BindingDB:
Activity Spreadsheet -- Enzyme Inhibition Constant Data from BindingDB
Found 1 hit for monomerid = 386986
TargetFree fatty acid receptor 4(Homo sapiens (Human))
Bristol-Myers Squibb
US Patent
LigandPNGBDBM386986(US9938222, Example 115)
Affinity DataEC50:  190nM. Assay description: For the pERK assay, 3×106 cells/mL cryopreserved human and mouse cells were thawed rapidly in a 37° C. water bath and added to a T-225 flask containi...
Ligand InfoPC cidPC sid
In DepthDetails US Patent