BDBM387004 US9938222, Example 133
SMILES CC(C)Oc1ccc(Cl)c(c1)-c1ccc(CCC2CC2C(O)=O)cc1
InChI Key InChIKey=ZSTKNTSOTLPYPD-UHFFFAOYSA-N
Data  1 EC50
  Tab Delimited (TSV)   2D SDfile   Computed 3D by Vconf -m prep SDfile
Find this compound or compounds like it in BindingDB:
Activity Spreadsheet -- Enzyme Inhibition Constant Data from BindingDB
Found 1 hit for monomerid = 387004
TargetFree fatty acid receptor 4(Homo sapiens (Human))
Bristol-Myers Squibb
US Patent
LigandPNGBDBM387004(US9938222, Example 133)
Affinity DataEC50:  1.86E+3nM. Assay description: For the pERK assay, 3×106 cells/mL cryopreserved human and mouse cells were thawed rapidly in a 37° C. water bath and added to a T-225 flask containi...
Ligand InfoPC cidPC sid
In DepthDetails US Patent