BDBM387012 (2S)-2-(4-Fluorophenyl)-2-methoxy-N-[5-[[(3R)-1-(6-methylpyridazin-3-yl)pyrrolidin-3-yl]amino]-1,3,4-thiadiazol-2-yl]acetamide and (2R)-2-(4-Fluorophenyl)-2-methoxy-N-[5-[[(3R)-1-(6-methylpyridazin-3-yl)pyrrolidin-3-yl]amino]-1,3,4-thiadiazol-2-yl]acetamide::US9938265, Example 5(b)
SMILES CO[C@@H](C(=O)Nc1nnc(N[C@@H]2CCN(C2)c2ccc(C)nn2)s1)c1ccc(F)cc1
InChI Key InChIKey=HXFKMUYISOOFNN-NVXWUHKLSA-N
Data  1 IC50
  Tab Delimited (TSV)   2D SDfile   Computed 3D by Vconf -m prep SDfile
Find this compound or compounds like it in BindingDB:
Activity Spreadsheet -- Enzyme Inhibition Constant Data from BindingDB
Found 1 hit for monomerid = 387012
TargetGlutaminase kidney isoform, mitochondrial [63-669](Homo sapiens (Human))
Astrazeneca
US Patent
LigandPNGBDBM387012((2S)-2-(4-Fluorophenyl)-2-methoxy-N-[5-[[(3R)-1-(6...)
Affinity DataIC50:  975nM. Assay description: A Glutamate Oxidase/AmplexRed coupled assay was used to measure the ability of compounds to bind to and inhibit the activity of GLS1 in vitro. 6His t...
Ligand InfoPC cidPC sid
In DepthDetails US Patent