BDBM387074 N5-(1-(3-Oxomorpholino)piperidin-4-yl)-1-(tetrahydro-2H-pyran-4-yl)-1H-pyrazole-3,5-dicarboxamide::US9938272, Example 20
SMILES NC(=O)c1cc(C(=O)NC2CCN(CC2)N2CCOCC2=O)n(n1)C1CCOCC1
InChI Key InChIKey=PRJSLQLDXNUKQB-UHFFFAOYSA-N
Data  1 KI
  Tab Delimited (TSV)   2D SDfile   Computed 3D by Vconf -m prep SDfile
Find this compound or compounds like it in BindingDB:
Activity Spreadsheet -- Enzyme Inhibition Constant Data from BindingDB
Found 1 hit for monomerid = 387074
TargetCoagulation factor X(Homo sapiens (Human))
North China Pharmaceutical
US Patent
LigandPNGBDBM387074(N5-(1-(3-Oxomorpholino)piperidin-4-yl)-1-(tetrahyd...)
Affinity DataKi:  30nM. Assay description: Factor Xa (human or rat): In the assay for measuring the inhibition of human or rat factor Xa activity, Tris-HCl buffer (50 mM, pH 8.3, 150 mM NaCl) ...
Ligand InfoPC cidPC sid
In DepthDetails US Patent