BDBM387075 1-(1-(Methylsulfonyl)piperidin-4-yl)-N5-(1-(3-oxomorpholino)piperidin-4-yl)-1H-pyrazole-3,5-dicarboxamide::US9938272, Example 21
SMILES CS(=O)(=O)N1CCC(CC1)n1nc(cc1C(=O)NC1CCN(CC1)N1CCOCC1=O)C(N)=O
InChI Key InChIKey=XWVZOOJOYLPYJD-UHFFFAOYSA-N
Data  1 KI
  Tab Delimited (TSV)   2D SDfile   Computed 3D by Vconf -m prep SDfile
Find this compound or compounds like it in BindingDB:
Activity Spreadsheet -- Enzyme Inhibition Constant Data from BindingDB
Found 1 hit for monomerid = 387075
TargetCoagulation factor X(Homo sapiens (Human))
North China Pharmaceutical
US Patent
LigandPNGBDBM387075(1-(1-(Methylsulfonyl)piperidin-4-yl)-N5-(1-(3-oxom...)
Affinity DataKi:  525nM. Assay description: Factor Xa (human or rat): In the assay for measuring the inhibition of human or rat factor Xa activity, Tris-HCl buffer (50 mM, pH 8.3, 150 mM NaCl) ...
Ligand InfoPC cidPC sid
In DepthDetails US Patent