BDBM387125 (3aR, 7aR)-1-(6-methylpyrazin-2-yl)-6-{[2- (2H-1,2,3-triazol-2- yl)phenyl]carbonyl}octahydro-1H- pyrrolo[2,3-c]pyridine::US9938276, B20
SMILES Cc1cnc(cn1)N1CC[C@@H]2CCN(C[C@H]12)C(=O)c1ccccc1-n1nccn1
InChI Key InChIKey=CCXWSMMQATYWSK-LPHOPBHVSA-N
Data  2 IC50
  Tab Delimited (TSV)   2D SDfile   Computed 3D by Vconf -m prep SDfile
Find this compound or compounds like it in BindingDB:
Activity Spreadsheet -- Enzyme Inhibition Constant Data from BindingDB
Found 2 hits for monomerid = 387125
TargetOrexin/Hypocretin receptor type 1(Homo sapiens (Human))
Merck Sharp & Dohme
US Patent
LigandPNGBDBM387125((3aR, 7aR)-1-(6-methylpyrazin-2-yl)-6-{[2- (2H-1,2...)
Affinity DataIC50:  1.00E+4nM. Assay description: The utility of the compounds in accordance with the present invention as orexin receptor OX1R and/or OX2R antagonists may be readily determined witho...
Ligand InfoPC cidPC sid
In DepthDetails US Patent
TargetOrexin receptor type 2(Homo sapiens (Human))
Merck Sharp & Dohme
US Patent
LigandPNGBDBM387125((3aR, 7aR)-1-(6-methylpyrazin-2-yl)-6-{[2- (2H-1,2...)
Affinity DataIC50:  2.08E+3nM. Assay description: The utility of the compounds in accordance with the present invention as orexin receptor OX1R and/or OX2R antagonists may be readily determined witho...
Ligand InfoPC cidPC sid
In DepthDetails US Patent