BDBM387218 US9938268, Compound 9
SMILES Fc1cc(F)cc(c1)C(=O)Nc1ccc(Nc2ccnc3[nH]c(=O)c4CCCCc4c23)cc1
InChI Key InChIKey=YBQZHUDVMDKFPO-UHFFFAOYSA-N
Data  1 IC50
  Tab Delimited (TSV)   2D SDfile   Computed 3D by Vconf -m prep SDfile
Find this compound or compounds like it in BindingDB:
Activity Spreadsheet -- Enzyme Inhibition Constant Data from BindingDB
Found 1 hit for monomerid = 387218
TargetAurora kinase A(Homo sapiens (Human))
Merck Patent
US Patent
LigandPNGBDBM387218(US9938268, Compound 9)
Affinity DataIC50:  5.5nM. Assay description: Assays are derived from other literature.
Ligand InfoPC cidPC sid
In DepthDetails US Patent