BDBM387225 US9938268, Compound 36
SMILES O=C(Nc1ccc(Nc2ccnc3[nH]c(=O)c4ccoc4c23)cc1)c1ccccc1
InChI Key InChIKey=ZXPJJIWBIVGQSO-UHFFFAOYSA-N
Data  1 IC50
  Tab Delimited (TSV)   2D SDfile   Computed 3D by Vconf -m prep SDfile
Find this compound or compounds like it in BindingDB:
Activity Spreadsheet -- Enzyme Inhibition Constant Data from BindingDB
Found 1 hit for monomerid = 387225
TargetAurora kinase A(Homo sapiens (Human))
Merck Patent
US Patent
LigandPNGBDBM387225(US9938268, Compound 36)
Affinity DataIC50:  55nM. Assay description: Assays are derived from other literature.
Ligand InfoPC cidPC sid
In DepthDetails US Patent