BDBM387232 US9938268, Compound 54
SMILES Fc1ccc(C(=O)Nc2ccc(Nc3ccnc4[nH]c(=O)c5CCCCc5c34)cc2F)c(c1)C(F)(F)F
InChI Key InChIKey=QZCBYZPWBXBBAC-UHFFFAOYSA-N
Data  1 IC50
  Tab Delimited (TSV)   2D SDfile   Computed 3D by Vconf -m prep SDfile
Find this compound or compounds like it in BindingDB:
Activity Spreadsheet -- Enzyme Inhibition Constant Data from BindingDB
Found 1 hit for monomerid = 387232
TargetAurora kinase A(Homo sapiens (Human))
Merck Patent
US Patent
LigandPNGBDBM387232(US9938268, Compound 54)
Affinity DataIC50:  5.5nM. Assay description: Assays are derived from other literature.
Ligand InfoPC cidPC sid
In DepthDetails US Patent