BDBM387255 US9938274, 18
SMILES CC(C)(O)COc1ccc2c(Oc3ccc(Nc4nccc5n(Cc6ccccc6)cc(-c6ccc(F)cc6)c(=O)c45)cc3F)ccnc2c1
InChI Key InChIKey=ZEBSYRKXLBQMCN-UHFFFAOYSA-N
Data  2 IC50
  Tab Delimited (TSV)   2D SDfile   Computed 3D by Vconf -m prep SDfile
Find this compound or compounds like it in BindingDB:
Activity Spreadsheet -- Enzyme Inhibition Constant Data from BindingDB
Found 2 hits for monomerid = 387255
TargetVascular endothelial growth factor receptor 2(Homo sapiens (Human))
Nanjing Natinefy Pharmatech
US Patent
LigandPNGBDBM387255(US9938274, 18)
Affinity DataIC50: >5.00E+3nM. Assay description: A study on inhibition of protein kinases activity at in vitro biochemical levelMaterial and method: kinases such as c-Met, VEGFR-2, Axl and RET, obta...
Ligand InfoPC cidPC sid
In DepthDetails US Patent
TargetHepatocyte growth factor receptor(Homo sapiens (Human))
Nanjing Natinefy Pharmatech
US Patent
LigandPNGBDBM387255(US9938274, 18)
Affinity DataIC50:  40.3nM. Assay description: A study on inhibition of protein kinases activity at in vitro biochemical levelMaterial and method: kinases such as c-Met, VEGFR-2, Axl and RET, obta...
Ligand InfoPC cidPC sid
In DepthDetails US Patent