BDBM387279 5-(2- (Difluoromethoxy)-5- (4-methyl-5-oxo-4,5- dihydro-1,3,4- oxadiazol-2- yl)phenyl)-N-(2,6- difluorophenyl) thiophene-2- carboxamide ::US10292981, Example 173
SMILES Cn1nc(oc1=O)-c1ccc(OC(F)F)c(c1)-c1ccc(s1)C(=O)Nc1c(F)cccc1F
InChI Key InChIKey=DXERDVIJRMRUCB-UHFFFAOYSA-N
Data  1 IC50
  Tab Delimited (TSV)   2D SDfile   Computed 3D by Vconf -m prep SDfile
Find this compound or compounds like it in BindingDB:
Activity Spreadsheet -- Enzyme Inhibition Constant Data from BindingDB
Found 1 hit for monomerid = 387279
TargetInterleukin-2(Homo sapiens (Human))
Lupin
US Patent
LigandPNGBDBM387279(5-(2- (Difluoromethoxy)-5- (4-methyl-5-oxo-4,5- di...)
Affinity DataIC50: <100nM. Assay description: Jurkat T cells were seeded at a density of 0.5 to 1 million cells per well in RPMI medium. Test compounds from this invention were added to the cells...
Ligand InfoPC cidPC sid
In DepthDetails US Patent