BDBM387281 N-(5-(5- (5,5-Dimethyl-4-oxo- 4,5-dihydroisoxazol- 3-yl)-2- methylphenyl)pyridin- 2-yl)-2,6- difluorobenzamide ::US10292981, Example 4
SMILES Cc1ccc(cc1-c1ccc(NC(=O)c2c(F)cccc2F)nc1)C1=NOC(C)(C)C1=O
InChI Key InChIKey=BBFUAFQFQUCONY-UHFFFAOYSA-N
Data  2 IC50
  Tab Delimited (TSV)   2D SDfile   Computed 3D by Vconf -m prep SDfile
Find this compound or compounds like it in BindingDB:
Activity Spreadsheet -- Enzyme Inhibition Constant Data from BindingDB
Found 2 hits for monomerid = 387281
TargetInterleukin-2(Homo sapiens (Human))
Lupin
Curated by ChEMBL
LigandPNGBDBM387281(N-(5-(5- (5,5-Dimethyl-4-oxo- 4,5-dihydroisoxazol-...)
Affinity DataIC50:  178nM. Assay description: Inhibition of PHA-stimulated IL2 secretion in human Jurkat T cells preincubated for 10 mins followed by PHA addition and measured after 20 to 24 hrs ...
Ligand InfoPC cidPC sid
In DepthDetails ArticlePubMed
TargetInterleukin-2(Homo sapiens (Human))
Lupin
Curated by ChEMBL
LigandPNGBDBM387281(N-(5-(5- (5,5-Dimethyl-4-oxo- 4,5-dihydroisoxazol-...)
Affinity DataIC50:  550nM. Assay description: Jurkat T cells were seeded at a density of 0.5 to 1 million cells per well in RPMI medium. Test compounds from this invention were added to the cells...
Ligand InfoPC cidPC sid
In DepthDetails US Patent