BDBM387318 N-{2-[6-(trifluoromethyl)pyridin-2-yl]pyrrolo[2,1-f][1,2,4]triazin-4-yl}-1,5-naphthyridin-4-amine::US10292985, Example 2
SMILES FC(F)(F)c1cccc(n1)-c1nc(Nc2ccnc3cccnc23)c2cccn2n1
InChI Key InChIKey=BKIMZLSUOAVQNQ-UHFFFAOYSA-N
Data  2 IC50
  Tab Delimited (TSV)   2D SDfile   Computed 3D by Vconf -m prep SDfile
Find this compound or compounds like it in BindingDB:
Activity Spreadsheet -- Enzyme Inhibition Constant Data from BindingDB
Found 2 hits for monomerid = 387318
TargetTGF-beta receptor type-2(Homo sapiens (Human))
Bristol-Myers Squibb
US Patent
LigandPNGBDBM387318(N-{2-[6-(trifluoromethyl)pyridin-2-yl]pyrrolo[2,1-...)
Affinity DataIC50: >1.50E+4nM
Ligand InfoPC cidPC sid
In DepthDetails US Patent
TargetTGF-beta receptor type-1(Homo sapiens (Human))
Bristol-Myers Squibb
US Patent
LigandPNGBDBM387318(N-{2-[6-(trifluoromethyl)pyridin-2-yl]pyrrolo[2,1-...)
Affinity DataIC50:  20nM. Assay description: Assays are conducted in 1536-well plates and 2 mL reactions are prepared from addition of HIS-TGFβR1 T204D or HIS-TGFβR2 WT, anti-HIS detec...
Ligand InfoPC cidPC sid
In DepthDetails US Patent