BDBM387429 N3-(3-Chloro-4- fluorophenyl)- 5- methoxyfuro [2,3-c]pyridine- 2,3-diamine::US10294212, No. 64
SMILES COc1cc2c(Nc3ccc(F)c(Cl)c3)c(N)oc2cn1
InChI Key InChIKey=QBASQQPCRIUBHP-UHFFFAOYSA-N
Data  1 IC50
  Tab Delimited (TSV)   2D SDfile   Computed 3D by Vconf -m prep SDfile
Find this compound or compounds like it in BindingDB:
Activity Spreadsheet -- Enzyme Inhibition Constant Data from BindingDB
Found 1 hit for monomerid = 387429
TargetIndoleamine 2,3-dioxygenase 1(Homo sapiens (Human))
Curadev Pharma
US Patent
LigandPNGBDBM387429(N3-(3-Chloro-4- fluorophenyl)- 5- methoxyfuro [2,3...)
Affinity DataIC50: <200nM. Assay description: Human indoleamine 2,3-dioxygenasel (hIDO1) catalyzes the oxidative cleavage of the pyrrole ring of the indole nucleus of tryptophan to yield N-formyl...
Ligand InfoPC cidPC sid
In DepthDetails US Patent