BDBM387728 US10294214, Example 28
SMILES CCOC(=O)c1nc2ccncc2c1NC(=O)CN1CCCC(C)(C)C1
InChI Key
Data  1 EC50
  Tab Delimited (TSV)   2D SDfile   Computed 3D by Vconf -m prep SDfile
Find this compound or compounds like it in BindingDB:
Activity Spreadsheet -- Enzyme Inhibition Constant Data from BindingDB
Found 1 hit for monomerid = 387728
TargetMelanocortin receptor 4(Homo sapiens (Human))
Vanderbilt University
US Patent
LigandPNGBDBM387728(US10294214, Example 28)
Affinity DataEC50:  1.59E+3nM. Assay description: Analysis of pharmacological properties of compounds was performed using the LANCE cAMP kit (Perkin Elmer). HEK293 cells stably expressing the hMC4R w...
Ligand InfoPC cidPC sid
In DepthDetails US Patent