BDBM387737 US10294214, Example 37
SMILES O=C(CN1CCC(CC1)C1CCCCC1)Nc1c(nc2ccccc12)C(=O)C1CC1
InChI Key
Data  1 EC50
  Tab Delimited (TSV)   2D SDfile   Computed 3D by Vconf -m prep SDfile
Find this compound or compounds like it in BindingDB:
Activity Spreadsheet -- Enzyme Inhibition Constant Data from BindingDB
Found 1 hit for monomerid = 387737
TargetMelanocortin receptor 4(Homo sapiens (Human))
Vanderbilt University
US Patent
LigandPNGBDBM387737(US10294214, Example 37)
Affinity DataEC50:  251nM. Assay description: Analysis of pharmacological properties of compounds was performed using the LANCE cAMP kit (Perkin Elmer). HEK293 cells stably expressing the hMC4R w...
Ligand InfoPC cidPC sid
In DepthDetails US Patent