BDBM387739 US10294214, Example 39
SMILES COC(=O)c1nc2ccc(Br)cc2c1NC(=O)CN1CCC(CC1)c1ccccc1
InChI Key
Data  1 EC50
  Tab Delimited (TSV)   2D SDfile   Computed 3D by Vconf -m prep SDfile
Find this compound or compounds like it in BindingDB:
Activity Spreadsheet -- Enzyme Inhibition Constant Data from BindingDB
Found 1 hit for monomerid = 387739
TargetMelanocortin receptor 4(Homo sapiens (Human))
Vanderbilt University
US Patent
LigandPNGBDBM387739(US10294214, Example 39)
Affinity DataEC50:  251nM. Assay description: Analysis of pharmacological properties of compounds was performed using the LANCE cAMP kit (Perkin Elmer). HEK293 cells stably expressing the hMC4R w...
Ligand InfoPC cidPC sid
In DepthDetails US Patent