BDBM387750 US10294214, Example 50
SMILES [#6]\[#6](-[#6])=[#6]-1/[#6]-[#6]-[#7](-[#6]-[#6](=O)-[#7]-c2c(nc3ccccc23)-[#6](=O)-[#6]-2-[#6]-[#6]-2)-[#6]-[#6]-1
InChI Key
Data  1 EC50
  Tab Delimited (TSV)   2D SDfile   Computed 3D by Vconf -m prep SDfile
Find this compound or compounds like it in BindingDB:
Activity Spreadsheet -- Enzyme Inhibition Constant Data from BindingDB
Found 1 hit for monomerid = 387750
TargetMelanocortin receptor 4(Homo sapiens (Human))
Vanderbilt University
US Patent
LigandPNGBDBM387750(US10294214, Example 50)
Affinity DataEC50:  794nM. Assay description: Analysis of pharmacological properties of compounds was performed using the LANCE cAMP kit (Perkin Elmer). HEK293 cells stably expressing the hMC4R w...
Ligand InfoPC cidPC sid
In DepthDetails US Patent