BDBM387776 US10294214, Example 76
SMILES CC1COCCN1c1ccc2nc(C(=O)C3CC3)c(NC(=O)CN3CCCC(C)(C)C3)c2c1
InChI Key
Data  1 EC50
  Tab Delimited (TSV)   2D SDfile   Computed 3D by Vconf -m prep SDfile
Find this compound or compounds like it in BindingDB:
Activity Spreadsheet -- Enzyme Inhibition Constant Data from BindingDB
Found 1 hit for monomerid = 387776
TargetMelanocortin receptor 4(Homo sapiens (Human))
Vanderbilt University
US Patent
LigandPNGBDBM387776(US10294214, Example 76)
Affinity DataEC50:  2.00E+3nM. Assay description: Analysis of pharmacological properties of compounds was performed using the LANCE cAMP kit (Perkin Elmer). HEK293 cells stably expressing the hMC4R w...
Ligand InfoPC cidPC sid
In DepthDetails US Patent