BDBM387789 US10294217, Example 10
SMILES O[C@H]1CCCC[C@@H]1NC(=O)c1cn(Cc2ccncc2F)c2c(F)ccc(F)c12
InChI Key InChIKey=ULUURGRPKBOSTR-ROUUACIJSA-N
Data  1 EC50
  Tab Delimited (TSV)   2D SDfile   Computed 3D by Vconf -m prep SDfile
Find this compound or compounds like it in BindingDB:
Activity Spreadsheet -- Enzyme Inhibition Constant Data from BindingDB
Found 1 hit for monomerid = 387789
TargetMuscarinic acetylcholine receptor M1(Homo sapiens (Human))
Suven Life Sciences
US Patent
LigandPNGBDBM387789(US10294217, Example 10)
Affinity DataEC50:  940nM. Assay description: A stable CHO cell line expressing recombinant human Muscarinic M1 receptor and pCRE-Luc reporter system was used for cell-based assay. The assay offe...
Ligand InfoPC cidPC sid
In DepthDetails US Patent