BDBM387806 US10294217, Example 33
SMILES FC1CNCCC1NC(=O)c1cn(Cc2ccccc2F)c2cccc(F)c12
InChI Key InChIKey=OTLJUDROSORFRW-UHFFFAOYSA-N
Data  1 EC50
  Tab Delimited (TSV)   2D SDfile   Computed 3D by Vconf -m prep SDfile
Find this compound or compounds like it in BindingDB:
Activity Spreadsheet -- Enzyme Inhibition Constant Data from BindingDB
Found 1 hit for monomerid = 387806
TargetMuscarinic acetylcholine receptor M1(Homo sapiens (Human))
Suven Life Sciences
US Patent
LigandPNGBDBM387806(US10294217, Example 33)
Affinity DataEC50:  1.37E+3nM. Assay description: A stable CHO cell line expressing recombinant human Muscarinic M1 receptor and pCRE-Luc reporter system was used for cell-based assay. The assay offe...
Ligand InfoPC cidPC sid
In DepthDetails US Patent