BDBM387863 US10294221, Example 28(b)
SMILES CCO[C@H](C(=O)Nc1nnc(N[C@@H]2CCN(C2)c2cccnn2)s1)c1ccc(OC)cc1
InChI Key InChIKey=PRHCXSNDPXZCNA-QAPCUYQASA-N
Data  1 IC50
  Tab Delimited (TSV)   2D SDfile   Computed 3D by Vconf -m prep SDfile
Find this compound or compounds like it in BindingDB:
Activity Spreadsheet -- Enzyme Inhibition Constant Data from BindingDB
Found 1 hit for monomerid = 387863
TargetGlutaminase kidney isoform, mitochondrial(Homo sapiens (Human))
Astrazeneca
US Patent
LigandPNGBDBM387863(US10294221, Example 28(b))
Affinity DataIC50:  84.8nM. Assay description: A Glutamate Oxidase/AmplexRed coupled assay was used to measure the ability of compounds to bind to and inhibit the activity of GLS1 in vitro. 6His t...
Ligand InfoPC cidPC sid
In DepthDetails US Patent