BDBM38795 4-phenyl-N-[3-[(4-phenylpiperazin-1-yl)carbonylamino]phenyl]piperazine-1-carboxamide::4-phenyl-N-[3-[(4-phenylpiperazine-1-carbonyl)amino]phenyl]piperazine-1-carboxamide::MLS000068850::N-[3-[[oxo-(4-phenyl-1-piperazinyl)methyl]amino]phenyl]-4-phenyl-1-piperazinecarboxamide::SMR000008895::cid_647933
SMILES O=C(Nc1cccc(NC(=O)N2CCN(CC2)c2ccccc2)c1)N1CCN(CC1)c1ccccc1
InChI Key InChIKey=LHPDDBGADQDQLZ-UHFFFAOYSA-N
Data  3 IC50
  Tab Delimited (TSV)   2D SDfile   Computed 3D by Vconf -m prep SDfile
Find this compound or compounds like it in BindingDB:
Activity Spreadsheet -- Enzyme Inhibition Constant Data from BindingDB
Found 3 hits for monomerid = 38795
TargetM-phase inducer phosphatase 2(Homo sapiens (Human))
University Of Pittsburgh
Curated by PubChem BioAssay
LigandPNGBDBM38795(4-phenyl-N-[3-[(4-phenylpiperazin-1-yl)carbonylami...)
Affinity DataIC50: >5.00E+4nM. Assay description: The Cdc25B Phosphatase HTS dose response confirmation has been developed to confirm actives identified in the Cdc25B HTS AID 368, screened at the Uni...
In DepthDetails PCBioAssay
TargetOrexin/Hypocretin receptor type 1(Homo sapiens (Human))
The Scripps Research Institute Molecular Screening Center
Curated by PubChem BioAssay
LigandPNGBDBM38795(4-phenyl-N-[3-[(4-phenylpiperazin-1-yl)carbonylami...)
Affinity DataIC50:  1.04E+4nM. Assay description: Source (MLPCN Center Name): The Scripps Research Institute Molecular Screening Center (SRIMSC) Affiliation: The Scripps Research Institute, TSRI Assa...
In DepthDetails PCBioAssay
TargetOrexin/Hypocretin receptor type 1(Homo sapiens (Human))
The Scripps Research Institute Molecular Screening Center
Curated by PubChem BioAssay
LigandPNGBDBM38795(4-phenyl-N-[3-[(4-phenylpiperazin-1-yl)carbonylami...)
Affinity DataIC50:  1.10E+4nM. Assay description: Source (MLPCN Center Name): The Scripps Research Institute Molecular Screening Center (SRIMSC) Affiliation: The Scripps Research Institute, TSRI Assa...
In DepthDetails PCBioAssay