BDBM387980 US10294229, Example 128
SMILES CC(C)Nc1cc(ncc1-c1cn(CCC(C)(C)O)nn1)-n1ncc2cc(cnc12)C#N
InChI Key InChIKey=UOSSKRBYOFVUDO-UHFFFAOYSA-N
Data  1 IC50
  Tab Delimited (TSV)   2D SDfile   Computed 3D by Vconf -m prep SDfile
Find this compound or compounds like it in BindingDB:
Activity Spreadsheet -- Enzyme Inhibition Constant Data from BindingDB
Found 1 hit for monomerid = 387980
TargetInterleukin-1 receptor-associated kinase 4(Homo sapiens (Human))
Bristol-Myers Squibb
US Patent
LigandPNGBDBM387980(US10294229, Example 128)
Affinity DataIC50:  1nM. Assay description: The assays were performed in U-bottom 384-well plates. The final assay volume was 30 μL prepared from 15 μL additions of enzyme and substra...
Ligand InfoPC cidPC sid
In DepthDetails US Patent