BDBM38799 4-(2,4-Dichloro-phenoxy)-N-(5-methyl-isoxazol-3-yl)-butyramide::4-(2,4-dichlorophenoxy)-N-(5-methyl-1,2-oxazol-3-yl)butanamide::4-(2,4-dichlorophenoxy)-N-(5-methyl-3-isoxazolyl)butanamide::4-(2,4-dichlorophenoxy)-N-(5-methylisoxazol-3-yl)butyramide::4-[2,4-bis(chloranyl)phenoxy]-N-(5-methyl-1,2-oxazol-3-yl)butanamide::MLS000075082::SMR000011787::cid_653219
SMILES Cc1cc(NC(=O)CCCOc2ccc(Cl)cc2Cl)no1
InChI Key InChIKey=MDWLVJCLJQXBQY-UHFFFAOYSA-N
Data  1 IC50
  Tab Delimited (TSV)   2D SDfile   Computed 3D by Vconf -m prep SDfile
Find this compound or compounds like it in BindingDB:
Activity Spreadsheet -- Enzyme Inhibition Constant Data from BindingDB
Found 1 hit for monomerid = 38799
TargetM-phase inducer phosphatase 2(Homo sapiens (Human))
University Of Pittsburgh
Curated by PubChem BioAssay
LigandPNGBDBM38799(4-(2,4-Dichloro-phenoxy)-N-(5-methyl-isoxazol-3-yl...)
Affinity DataIC50: >5.00E+4nM. Assay description: The Cdc25B Phosphatase HTS dose response confirmation has been developed to confirm actives identified in the Cdc25B HTS AID 368, screened at the Uni...
In DepthDetails PCBioAssay