BDBM388196 (�)-1-(5-(4-(2-fluoro-3-hydroxy-3-methylbutyl)-1H-1,2,3-triazol-1-yl)-4-(isopropylamino)pyridin-2-yl)-1H-pyrazolo[3,4-b]pyridine-5-carbonitrile (Racemic)::US10294229, Example 345
SMILES CC(C)Nc1cc(ncc1-n1cc(CC(F)C(C)(C)O)nn1)-n1ncc2cc(cnc12)C#N
InChI Key InChIKey=KUBKRYARXKXMBP-UHFFFAOYSA-N
Data  2 IC50
  Tab Delimited (TSV)   2D SDfile   Computed 3D by Vconf -m prep SDfile
Find this compound or compounds like it in BindingDB:
Activity Spreadsheet -- Enzyme Inhibition Constant Data from BindingDB
Found 2 hits for monomerid = 388196
TargetInterleukin-1 receptor-associated kinase 4(Homo sapiens (Human))
Bristol-Myers Squibb
US Patent
LigandPNGBDBM388196((�)-1-(5-(4-(2-fluoro-3-hydroxy-3-methylbut...)
Affinity DataIC50:  2nM. Assay description: The assays were performed in U-bottom 384-well plates. The final assay volume was 30 μL prepared from 15 μL additions of enzyme and substra...
Ligand InfoPC cidPC sid
In DepthDetails US Patent
TargetInterleukin-1 receptor-associated kinase 4(Homo sapiens (Human))
Bristol-Myers Squibb
US Patent
LigandPNGBDBM388196((�)-1-(5-(4-(2-fluoro-3-hydroxy-3-methylbut...)
Affinity DataIC50:  4nM. Assay description: The assays were performed in U-bottom 384-well plates. The final assay volume was 30 μL prepared from 15 μL additions of enzyme and substra...
Ligand InfoPC cidPC sid
In DepthDetails US Patent