BDBM388276 US10294229, Example 426
SMILES CC(C)Nc1cc(ncc1-c1cc(CCC(C)(C)O)no1)-n1ncc2cc(cnc12)C#N
InChI Key InChIKey=RHEFUXIXJKSSIC-UHFFFAOYSA-N
Data  1 IC50
  Tab Delimited (TSV)   2D SDfile   Computed 3D by Vconf -m prep SDfile
Find this compound or compounds like it in BindingDB:
Activity Spreadsheet -- Enzyme Inhibition Constant Data from BindingDB
Found 1 hit for monomerid = 388276
TargetInterleukin-1 receptor-associated kinase 4(Homo sapiens (Human))
Bristol-Myers Squibb
US Patent
LigandPNGBDBM388276(US10294229, Example 426)
Affinity DataIC50:  1nM. Assay description: The assays were performed in U-bottom 384-well plates. The final assay volume was 30 μL prepared from 15 μL additions of enzyme and substra...
Ligand InfoPC cidPC sid
In DepthDetails US Patent